{"text_format":"2","workbook":"xlsx","n_sheets":7,"sheets":["Submital","Drawings","Data","performance","physical data","electrical data","Center Mount Options"],"not_rendered":{"charts":0,"images":18,"macros":0,"external_links":0,"defined_names":18,"comments":0,"pivot_tables":0},"unopened":[],"bounds":{"document_bytes":16777216,"sheet_cells":100000,"run_cost":"one","rows_first":2000,"rows_last":500,"rows_between":2000,"halvings":0,"cell_chars":16384,"cell_head_chars":4096},"cells_cut":0,"cells_raw":0,"read":"whole","date_system":"1900"}

{"sheet":"Submital","index":0,"n_rows":51,"n_cols":21,"rows_kept":51,"cut":false,"hidden":false,"merged":[[38,0,38,13],[39,0,40,1],[13,0,13,1],[15,5,15,13],[16,8,16,10],[17,8,17,10],[16,11,16,13],[17,11,17,13],[15,0,15,4],[16,0,16,4],[17,0,17,4],[16,5,16,7],[17,5,17,7],[14,0,14,13],[13,6,13,7],[13,12,13,13],[45,0,45,1],[43,0,44,1],[45,9,45,10],[43,4,44,4],[43,5,44,5],[43,2,44,2],[43,3,44,3],[43,7,44,8],[45,7,45,8],[42,0,42,13],[43,6,44,6],[43,9,44,10],[43,13,44,13],[43,11,44,11],[43,12,44,12],[41,0,41,1],[39,10,40,10],[39,13,40,13],[39,9,40,9],[39,11,40,11],[39,12,40,12],[39,8,40,8],[41,6,41,7],[39,6,40,7],[39,3,39,5],[39,2,40,2],[13,4,13,5],[13,8,13,9],[13,10,13,11],[11,0,11,13],[12,0,12,1],[12,8,12,9],[12,12,12,13],[9,5,9,7],[10,5,10,7],[9,0,9,4],[10,0,10,4],[12,4,12,5],[12,6,12,7],[7,0,7,4],[8,0,8,4],[5,0,5,13],[18,0,37,13],[6,8,6,10],[7,8,7,10],[8,8,8,10],[9,8,9,10],[8,5,8,7],[6,11,6,13],[7,11,7,13],[8,11,8,13],[9,11,9,13],[10,11,10,13],[12,2,12,3],[13,2,13,3],[46,0,46,13],[4,6,4,10],[4,12,4,13],[0,0,4,5],[0,6,0,10],[0,11,0,13],[1,6,1,10],[1,11,1,13],[2,6,2,10],[2,11,2,13],[3,6,3,10],[3,12,3,13],[10,8,10,10],[6,5,6,7],[7,5,7,7],[6,0,6,4],[50,0,50,13],[51,0,54,13],[47,8,47,13],[48,8,48,13],[49,8,49,13],[47,6,49,7],[47,0,47,5],[48,0,48,5],[49,0,49,5]]}
[{"$nulls":6},"HEAT TRANSFER PRODUCTS GROUP, LLC",{"$nulls":4},"SUBMITTAL DATA SHEET"]
[{"$nulls":6},"3885 Crestwood Parkway / Suite 500",{"$nulls":4},{"$f":"IF(LEFT(I14,1)=\"E\",\"CENTER MOUNT\",IF(LEFT(I14,1)=\"V\",\"LOW VELOCITY CENTER MOUNT\",0))","v":0}]
[{"$nulls":6},"Duluth, GA  30096",{"$nulls":4},"UNIT COOLER"]
[{"$nulls":6},"(P) 800-288-9488 / (F) 256-259-7478",{"$nulls":5},"For Record Only"]
[{"$nulls":6},"https://www.htpg.com/",{"$nulls":5},"For Approval"]
[{"$f":"\"Rev. \"","v":"Rev. "}]
["Job Name:",{"$nulls":7},"Job Location:"]
["Customer Name:",{"$nulls":7},"Order Number:"]
["Architect / Engineer:",{"$nulls":7},"Prepared By:"]
["Unit Model Number:",{"$nulls":4},{"$f":"Data!B7&Submital!I14&Data!O1","v":{"$error":"#N/A"}},null,null,"Tagging Info:"]
["Unit Quantity:",{"$nulls":7},"Date:"]
["Select unit attributes from the drop down menus below to build required model number"]
["Brand",null,"Motor Type",null,"Fins/Inch",null,"Defrost Type",null,"Base Model",null,"Temperature Range",null,"Unit Voltage"]
[{"$nulls":10},{"$f":"VLOOKUP(I14,performance!C:I,6,FALSE)","v":{"$error":"#N/A"}}]
["**clear all  fields when starting over**"]
["Dew Point Suction",{"$nulls":4},"Capacity Data at 10ºF TD"]
["Temperature  ",{"$nulls":4},"R404A",null,null,"R407A",null,null,"CFM"]
[{"$f":"IF(K14=\"Medium Temp\",\"+25ºF\",\"-20ºF\")","v":{"$error":"#N/A"}},{"$nulls":4},{"$f":"VLOOKUP(I14,performance!C:G,2,FALSE)","v":{"$error":"#N/A"}},null,null,{"$f":"VLOOKUP(I14,performance!C:G,3,FALSE)","v":{"$error":"#N/A"}},null,null,{"$f":"VLOOKUP(I14,performance!C:G,4,FALSE)","v":{"$error":"#N/A"}}]
{"$rows_empty":20}
["Physical Data"]
["Base Model",null,"Fins/Inch","Refrig. Conn (ODS)",null,null,"Drain Conn",null,"Installed Weight","Ship Weight ","Number of Fans","--","--","--"]
[null,null,null,"Liquid","Suction","Ext Equal"]
[{"$f":"I14","v":0},null,{"$f":"E14","v":0},{"$f":"VLOOKUP(I14,'physical data'!D:H,2,FALSE)","v":{"$error":"#N/A"}},{"$f":"VLOOKUP(I14,'physical data'!D:H,3,FALSE)","v":{"$error":"#N/A"}},"1/4\"","3/4\" NPT",null,{"$f":"VLOOKUP(I14,'physical data'!D:H,4,FALSE)","v":{"$error":"#N/A"}},{"$f":"VLOOKUP(I14,'physical data'!D:H,5,FALSE)","v":{"$error":"#N/A"}},{"$f":"VLOOKUP(I14,performance!C:I,5,FALSE)","v":{"$error":"#N/A"}},"--","--","--"]
["Electrical Data"]
["Voltage",null,"Hertz","Heater Amps","Heater Watts","MCA","MOPD","EC Mtr Amps Ea. ",null,"Total Motor Amps EC Mtr",null,"--","--","--"]
[]
[{"$f":"M14","v":0},null,"50/60",{"$f":"VLOOKUP(Submital!I14,'electrical data'!D:M,10,FALSE)","v":{"$error":"#N/A"}},{"$f":"VLOOKUP(Submital!I14,'electrical data'!D:M,9,FALSE)","v":{"$error":"#N/A"}},{"$f":"VLOOKUP(I14,'electrical data'!$D$2:$K$44,IF(Submital!Q47=1,6,5),FALSE)","v":{"$error":"#N/A"}},{"$f":"VLOOKUP(I14,'electrical data'!$D$2:$K$44,IF(Submital!Q47=1,8,7),FALSE)","v":{"$error":"#N/A"}},".84 Max",null,{"$f":"K42*0.84","v":{"$error":"#N/A"}},null,"--","--","--"]
["Options ",{"$nulls":15},{"$f":"SUM(Q48:R50)","v":0},null,null,{"$f":"SUM(T48:U50)","v":0},{"$f":"IF(AND(Q47>0,T47>0),1,0)","v":0}]
[{"$nulls":6},{"$f":"IF(U47=1,\"CONFIGURATION CONFLICT\",\"\")","v":""},{"$nulls":9},{"$f":"IF(A48=\"EcoNet\",1,0)","v":0},{"$f":"IF(I48=\"EcoNet\",1,0)","v":0},null,{"$f":"IF(A48=\"Thermostatic Expansion Valve - Mounted\",1,IF(A48=\"Electronic Expansion Valve - Mounted\",1,IF(A48=\"Liquid Line Solenoid Valve - Mounted\",1,IF(A48=\"Mechanical Thermostat - Mounted\",1,IF(A48=\"Electronic Room Thermostat - Mounted\",1,0)))))","v":0},{"$f":"IF(I48=\"Thermostatic Expansion Valve - Mounted\",1,IF(I48=\"Electronic Expansion Valve - Mounted\",1,IF(I48=\"Liquid Line Solenoid Valve - Mounted\",1,IF(I48=\"Mechanical Thermostat - Mounted\",1,IF(I48=\"Electronic Room Thermostat - Mounted\",1,0)))))","v":0}]
[{"$nulls":16},{"$f":"IF(A49=\"EcoNet\",1,0)","v":0},{"$f":"IF(C49=\"EcoNet\",1,0)","v":0},null,{"$f":"IF(A49=\"Thermostatic Expansion Valve - Mounted\",1,IF(A49=\"Electronic Expansion Valve - Mounted\",1,IF(A49=\"Liquid Line Solenoid Valve - Mounted\",1,IF(A49=\"Mechanical Thermostat - Mounted\",1,IF(A49=\"Electronic Room Thermostat - Mounted\",1,0)))))","v":0},{"$f":"IF(I49=\"Thermostatic Expansion Valve - Mounted\",1,IF(I49=\"Electronic Expansion Valve - Mounted\",1,IF(I49=\"Liquid Line Solenoid Valve - Mounted\",1,IF(I49=\"Mechanical Thermostat - Mounted\",1,IF(I49=\"Electronic Room Thermostat - Mounted\",1,0)))))","v":0}]
[{"$nulls":16},{"$f":"IF(A50=\"EcoNet\",1,0)","v":0},{"$f":"IF(C50=\"EcoNet\",1,0)","v":0},null,0,0]
["Additional Notes"]

{"sheet":"Drawings","index":1,"n_rows":20,"n_cols":4,"rows_kept":20,"cut":false,"hidden":true,"merged":[]}
[]
[null,"Fan1Short"]
[null,"Fan2Short"]
[null,"Fan3Short"]
[null,"Fan4Short"]
[null,"Fan5Short"]
[null,"Fan1Tall"]
[null,"Fan2Tall"]
[null,"Fan3Tall"]
[null,"Fan4Tall"]
[null,"Fan5Tall"]
[]
[]
[]
[]
[]
[null,null,null,"Russell"]
[null,null,null,"Witt"]
[null,null,null,"Kramer"]
[null,null,null,"ColdZone"]

{"sheet":"Data","index":2,"n_rows":56,"n_cols":20,"rows_kept":56,"cut":false,"hidden":true,"merged":[]}
["Russell","R",null,"Air ",null,4,null,null,null,"Low Temp",null,null,"115V",{"$f":"IF(Submital!M14=Data!M1,\"A\",IF(Submital!M14=Data!M2,\"D\",0))","v":0},{"$f":"N1&K12&\"A\"","v":"00A"}]
["Witt","W",null,"Electric",null,6,null,null,null,"Medium Temp",null,null,"208-230V"]
["Kramer","K"]
["ColdZone","C",{"$nulls":14},1,2,3,4]
[{"$nulls":12},1,{"$f":"IF(VLOOKUP(M5,$Q$5:$T$23,$G$11,FALSE)=0,\"\",VLOOKUP(M5,$Q$5:$T$23,$G$11,FALSE))","v":{"$error":"#REF!"}},null,null,1,"E6A041","E6E037","E4E037"]
["Brand",{"$f":"Submital!A14","v":0},null,"fpi","defrost type",{"$nulls":7},2,{"$error":"#REF!"},null,null,2,"E6A070","E6E045","E4E075"]
[null,{"$f":"VLOOKUP(B6,A1:B4,2,FALSE)","v":{"$error":"#N/A"}},null,{"$f":"Submital!E14","v":0},{"$f":"Submital!G14","v":0},null,{"$f":"D7&E7","v":"00"},null,null,"4Electric",4,null,3,{"$error":"#REF!"},null,null,3,"E6A084","E6E075","E4E107"]
[{"$nulls":9},"6Electric",3,null,4,{"$error":"#REF!"},null,null,4,"E6A104","E6E089","E4E149"]
[{"$nulls":9},"6Air ",2,null,5,{"$error":"#REF!"},null,null,5,"E6A128","E6E108","E4E186"]
[{"$nulls":12},6,{"$error":"#REF!"},null,null,6,"E6A141","E6E125","E4E234"]
[{"$nulls":6},{"$f":"VLOOKUP(G7,J7:K9,2,FALSE)","v":{"$error":"#N/A"}},{"$nulls":5},7,{"$error":"#REF!"},null,null,7,"E6A169","E6E137"]
[{"$nulls":9},"Single Speed ECM",{"$f":"IF(Submital!C14=Data!J12,\"E\",IF(Submital!C14=Data!J13,\"D\",0))","v":0},null,8,{"$error":"#REF!"},null,null,8,"E6A204","E6E182"]
[{"$nulls":9},"Dual Speed ECM",null,null,9,{"$error":"#REF!"},null,null,9,"E6A258","E6E221"]
[null,null,null,"E6A041","Fan1Short",{"$f":"VLOOKUP(Submital!I14,Data!$D$14:$E$56,2,FALSE)","v":{"$error":"#N/A"}},{"$nulls":6},10,{"$error":"#REF!"},null,null,10,"V6A043","E6E278"]
[null,null,null,"E6A070","Fan2Short",{"$nulls":7},11,{"$error":"#REF!"},null,null,11,"V6A053","V6E043"]
[null,null,null,"E6A084","Fan2Short",{"$nulls":7},12,{"$error":"#REF!"},null,null,12,"V6A085","V6E053"]
[null,null,null,"E6A104","Fan3Short",{"$nulls":7},13,{"$error":"#REF!"},null,null,13,"V6A106","V6E085"]
[null,null,null,"E6A128","Fan3Short",{"$nulls":7},14,{"$error":"#REF!"},null,null,14,"V6A129","V6E106"]
[null,null,null,"E6A141","Fan4Short",{"$nulls":7},15,{"$error":"#REF!"},null,null,15,"V6A158","V6E129"]
[null,null,null,"E6A169","Fan4Short",{"$nulls":7},16,{"$error":"#REF!"},null,null,16,"V6A176","V6E158"]
[null,null,null,"E6A204","Fan5Short",{"$nulls":7},17,{"$error":"#REF!"},null,null,17,"V6A218","V6E176"]
[null,null,null,"E6A258","Fan5Tall",{"$nulls":7},18,{"$error":"#REF!"},null,null,18,"V6A271","V6E218"]
[null,null,null,"V6A043","Fan1Tall",{"$nulls":7},19,{"$f":"IF(VLOOKUP(M23,$Q$5:$T$23,$G$11,FALSE)=0,\"\",VLOOKUP(M23,$Q$5:$T$23,$G$11,FALSE))","v":{"$error":"#REF!"}},null,null,19,null,"V6E271"]
[null,null,null,"V6A053","Fan1Tall"]
[null,null,null,"V6A085","Fan2Tall"]
[null,null,null,"V6A106","Fan2Tall"]
[null,null,null,"V6A129","Fan3Tall"]
[null,null,null,"V6A158","Fan3Tall"]
[null,null,null,"V6A176","Fan4Tall"]
[null,null,null,"V6A218","Fan4Tall"]
[null,null,null,"V6A271","Fan5Tall"]
[null,null,null,"E6E037","Fan1Short"]
[null,null,null,"E6E045","Fan1Short"]
[null,null,null,"E6E075","Fan2Short"]
[null,null,null,"E6E089","Fan2Short"]
[null,null,null,"E6E108","Fan3Short"]
[null,null,null,"E6E125","Fan3Short"]
[null,null,null,"E6E137","Fan4Short"]
[null,null,null,"E6E182","Fan4Short"]
[null,null,null,"E6E221","Fan5Short"]
[null,null,null,"E6E278","Fan5Tall"]
[null,null,null,"V6E043","Fan1Tall"]
[null,null,null,"V6E053","Fan1Tall"]
[null,null,null,"V6E085","Fan2Tall"]
[null,null,null,"V6E106","Fan2Tall"]
[null,null,null,"V6E129","Fan3Tall"]
[null,null,null,"V6E158","Fan3Tall"]
[null,null,null,"V6E176","Fan4Tall"]
[null,null,null,"V6E218","Fan4Tall"]
[null,null,null,"V6E271","Fan5Tall"]
[null,null,null,"E4E037","Fan1Short"]
[null,null,null,"E4E075","Fan2Short"]
[null,null,null,"E4E107","Fan3Short"]
[null,null,null,"E4E149","Fan4Short"]
[null,null,null,"E4E186","Fan5Short"]
[null,null,null,"E4E234","Fan5Tall"]

{"sheet":"performance","index":3,"n_rows":47,"n_cols":15,"rows_kept":47,"cut":false,"hidden":true,"merged":[[0,7,3,7],[0,8,3,8],[0,2,3,2],[0,3,3,3],[0,4,3,4],[0,5,3,5],[0,6,3,6]]}
[null,null,"Model Number Revision A",404,407,"CFM","Number of Fans","Application","Voltage"]
[]
[{"$nulls":12},"Voltage",2,3]
[{"$nulls":12},1,"115V","208-230V"]
[null,null,"E6A041",4100,4900,572,1,"Medium Temp",2,null,null,null,2,"208-230V"]
[null,null,"E6A070",7000,8200,1204,1,"Medium Temp",2]
[null,null,"E6A084",8400,9900,1144,2,"Medium Temp",2]
[null,null,"E6A104",10400,12300,1806,3,"Medium Temp",2,null,null,null,1,{"$f":"VLOOKUP(M8,M3:O5,K15,FALSE)","v":{"$error":"#REF!"}}]
[null,null,"E6A128",12800,15100,1716,3,"Medium Temp",2,null,null,null,2,{"$f":"IF(VLOOKUP(M9,M3:O5,K15,FALSE)=0,\"\",VLOOKUP(M9,M3:O5,K15,FALSE))","v":{"$error":"#REF!"}}]
[null,null,"E6A141",14100,16600,2408,4,"Medium Temp",2]
[null,null,"E6A169",16900,19900,2288,4,"Medium Temp",2]
[null,null,"E6A204",20400,23900,2860,5,"Medium Temp",2]
[null,null,"E6A258",25800,30400,3150,5,"Medium Temp",2]
[null,null,"E6E037",3700,4300,602,1,"Low Temp",3,null,"Voltage Column "]
[null,null,"E6E045",4500,5200,572,1,"Low Temp",3,null,{"$f":"VLOOKUP(Submital!I14,C:I,7,FALSE)","v":{"$error":"#N/A"}}]
[null,null,"E6E075",7500,8700,1204,2,"Low Temp",3]
[null,null,"E6E089",8900,10300,1144,2,"Low Temp",3]
[null,null,"E6E108",10800,12400,1806,3,"Low Temp",3]
[null,null,"E6E125",12500,14300,1716,3,"Low Temp",3]
[null,null,"E6E137",13700,15400,2408,4,"Low Temp",3]
[null,null,"E6E182",18200,20900,2288,4,"Low Temp",3]
[null,null,"E6E221",22100,25500,2860,5,"Low Temp",3]
[null,null,"E6E278",27800,32400,3150,5,"Low Temp",3]
[null,null,"E4E037",3700,4300,572,1,"Low Temp",3]
[null,null,"E4E075",7500,8700,1144,2,"Low Temp",3]
[null,null,"E4E107",10700,12200,1716,3,"Low Temp",3]
[null,null,"E4E149",14900,17600,2288,4,"Low Temp",3]
[null,null,"E4E186",18600,21300,2860,5,"Low Temp",3]
[null,null,"E4E234",23400,27200,3150,5,"Low Temp",3]
[null,null,"V6A043",4300,5100,654,1,"Medium Temp",2]
[null,null,"V6A053",5300,6300,632,1,"Medium Temp",2]
[null,null,"V6A085",8500,10100,1308,2,"Medium Temp",2]
[null,null,"V6A106",10600,12600,1264,2,"Medium Temp",2]
[null,null,"V6A129",12900,15300,1962,3,"Medium Temp",2]
[null,null,"V6A158",15800,18800,1896,3,"Medium Temp",2]
[null,null,"V6A176",17600,20800,2616,4,"Medium Temp",2]
[null,null,"V6A218",21800,26000,2528,4,"Medium Temp",2]
[null,null,"V6A271",27100,32500,3160,5,"Medium Temp",2]
[null,null,"V6E043",4300,5100,654,1,"Medium Temp",3]
[null,null,"V6E053",5300,6300,632,1,"Medium Temp",3]
[null,null,"V6E085",8500,10100,1308,2,"Medium Temp",3]
[null,null,"V6E106",10600,12600,1264,2,"Medium Temp",3]
[null,null,"V6E129",12900,15300,1962,3,"Medium Temp",3]
[null,null,"V6E158",15800,18800,1896,3,"Medium Temp",3]
[null,null,"V6E176",17600,20800,2616,4,"Medium Temp",3]
[null,null,"V6E218",21800,26000,2528,4,"Medium Temp",3]
[null,null,"V6E271",27100,32500,3160,5,"Medium Temp",3]

{"sheet":"physical data","index":4,"n_rows":45,"n_cols":8,"rows_kept":45,"cut":false,"hidden":true,"merged":[[0,4,0,5],[0,6,0,7]]}
[{"$nulls":4},"REFRIGERANT CONNECTIONS",null,"Approximate Weights"]
[{"$nulls":4},"ALL LIQUID","SUCTION","Installed","Ship"]
[null,null,null,"E6A041",0.375,0.625,55,190]
[null,null,null,"E6A070",0.375,0.625,75,210]
[null,null,null,"E6A084",0.375,0.625,80,215]
[null,null,null,"E6A104",0.375,0.625,95,230]
[null,null,null,"E6A128",0.375,0.875,105,240]
[null,null,null,"E6A141",0.375,0.875,120,280]
[null,null,null,"E6A169",0.375,0.875,130,290]
[null,null,null,"E6A204",0.375,1.125,145,330]
[null,null,null,"E6A258",0.375,1.125,155,340]
[null,null,null,"E6E037",0.375,0.625,50,185]
[null,null,null,"E6E045",0.375,0.625,55,190]
[null,null,null,"E6E075",0.375,0.625,75,210]
[null,null,null,"E6E089",0.375,0.625,80,215]
[null,null,null,"E6E108",0.375,0.875,95,230]
[null,null,null,"E6E125",0.375,0.875,105,240]
[null,null,null,"E6E137",0.375,0.875,120,280]
[null,null,null,"E6E182",0.375,0.875,130,290]
[null,null,null,"E6E221",0.375,1.125,145,330]
[null,null,null,"E6E278",0.375,1.125,155,340]
[null,null,null,"E4E037",0.375,0.625,55,190]
[null,null,null,"E4E075",0.375,0.625,80,215]
[null,null,null,"E4E107",0.375,0.875,105,240]
[null,null,null,"E4E149",0.375,0.875,130,290]
[null,null,null,"E4E186",0.375,1.125,145,330]
[null,null,null,"E4E234",0.375,1.125,155,340]
[null,null,null,"V6A043",0.375,0.625,60,195]
[null,null,null,"V6A053",0.375,0.625,60,195]
[null,null,null,"V6A085",0.375,0.625,80,115]
[null,null,null,"V6A106",0.375,0.625,80,215]
[null,null,null,"V6A129",0.375,0.875,100,235]
[null,null,null,"V6A158",0.375,0.875,100,235]
[null,null,null,"V6A176",0.375,0.875,125,285]
[null,null,null,"V6A218",0.375,0.875,125,285]
[null,null,null,"V6A271",0.375,1.125,155,340]
[null,null,null,"V6E043",0.375,0.625,60,195]
[null,null,null,"V6E053",0.375,0.625,60,195]
[null,null,null,"V6E085",0.375,0.625,80,115]
[null,null,null,"V6E106",0.375,0.625,80,215]
[null,null,null,"V6E129",0.375,0.875,100,235]
[null,null,null,"V6E158",0.375,0.875,100,235]
[null,null,null,"V6E176",0.375,0.875,125,285]
[null,null,null,"V6E218",0.375,0.875,125,285]
[null,null,null,"V6E271",0.375,1.125,155,340]

{"sheet":"electrical data","index":5,"n_rows":44,"n_cols":13,"rows_kept":44,"cut":false,"hidden":true,"merged":[]}
[null,null,null,"Model","#fans","#rows","ckts","mca","eco - mca","mopd","eco - mopd","heater watts","heater amps"]
[null,null,null,"E6A041",1,4,2,15,15,20,20,"--","--"]
[null,null,null,"E6A070",2,3,2,15,15,20,20,"--","--"]
[null,null,null,"E6A084",2,4,2,15,15,20,20,"--","--"]
[null,null,null,"E6A104",3,3,4,15,15,20,20,"--","--"]
[null,null,null,"E6A128",3,4,4,15,15,20,20,"--","--"]
[null,null,null,"E6A141",4,3,4,15,15,20,20,"--","--"]
[null,null,null,"E6A169",4,4,4,15,15,20,20,"--","--"]
[null,null,null,"E6A204",5,4,4,15,15,20,20,"--","--"]
[null,null,null,"E6A258",5,4,6,15,15,20,20,"--","--"]
[null,null,null,"E6E037",1,3,2,15,15,20,20,750,3.2]
[null,null,null,"E6E045",1,4,2,15,15,20,20,750,3.2]
[null,null,null,"E6E075",2,3,4,15,15,20,20,1500,6.5]
[null,null,null,"E6E089",2,4,4,15,15,20,20,1500,6.5]
[null,null,null,"E6E108",3,3,4,15,15,20,20,2250,9.8000000000000007]
[null,null,null,"E6E125",3,4,4,15,15,20,20,2250,9.8000000000000007]
[null,null,null,"E6E137",4,3,4,15,15,20,20,3000,13]
[null,null,null,"E6E182",4,4,8,15,15,20,20,3000,13]
[null,null,null,"E6E221",5,4,8,15,16.3,20,20,3750,16.3]
[null,null,null,"E6E278",5,4,12,15,24.4,20,30,5620,24.4]
[null,null,null,"E4E037",1,4,2,15,15,20,20,750,3.2]
[null,null,null,"E4E075",2,4,4,15,15,20,20,1500,6.5]
[null,null,null,"E4E107",3,4,4,15,15,20,20,2250,9.8000000000000007]
[null,null,null,"E4E149",4,4,8,15,15,20,20,3000,13]
[null,null,null,"E4E186",5,4,8,15,16.3,20,20,3750,16.3]
[null,null,null,"E4E234",5,4,12,15,24.4,20,30,5620,24.4]
[null,null,null,"V6A043",1,3,2,15,15,20,20,"--","--"]
[null,null,null,"V6A053",1,4,2,15,15,20,20,"--","--"]
[null,null,null,"V6A085",2,3,2,15,15,20,20,"--","--"]
[null,null,null,"V6A106",2,4,4,15,15,20,20,"--","--"]
[null,null,null,"V6A129",3,3,6,15,15,20,20,"--","--"]
[null,null,null,"V6A158",3,4,6,15,15,20,20,"--","--"]
[null,null,null,"V6A176",4,3,6,15,15,20,20,"--","--"]
[null,null,null,"V6A218",4,4,8,15,15,20,20,"--","--"]
[null,null,null,"V6A271",5,4,12,15,15,20,20,"--","--"]
[null,null,null,"V6E043",1,3,2,15,15,20,20,600,2.6]
[null,null,null,"V6E053",1,4,2,15,15,20,20,600,2.6]
[null,null,null,"V6E085",2,3,2,15,15,20,20,1200,5.2]
[null,null,null,"V6E106",2,4,4,15,15,20,20,1200,5.2]
[null,null,null,"V6E129",3,3,6,15,15,20,20,1800,7.8]
[null,null,null,"V6E158",3,4,6,15,15,20,20,1800,7.8]
[null,null,null,"V6E176",4,3,6,15,15,20,20,1800,7.8]
[null,null,null,"V6E218",4,4,8,15,15,20,20,2400,10.4]
[null,null,null,"V6E271",5,4,12,15,15,20,20,3000,13]

{"sheet":"Center Mount Options","index":6,"n_rows":20,"n_cols":1,"rows_kept":20,"cut":false,"hidden":true,"merged":[]}
["Generic Option Name"]
["EcoNet"]
["Mechanical Thermostat - Mounted"]
["Electronic Room Thermostat - Mounted"]
["Thermostatic Expanion Valve - Mounted"]
["Electronic Expansion Valve - Mounted"]
["Liquid Line Solenoid Valve - Mounted"]
["Mechanical Thermostat - Loose"]
["Electronic Room Thermostat - Loose"]
["EcoNet Command Center - Loose"]
["Thermostatic Expansion Valve - Loose"]
["Electronic Expanison Valve - Loose"]
["Liquid Line Solenoid Valve - Loose"]
["Heat Exchanger HX-25 - Loose"]
["Heat Exchanger HX-50 - Loose"]
["Heat Exchanger HX-75 - Loose"]
["Heat Exchanger HX-100 - Loose"]
["Heat Exchanger HX-150 - Loose"]
["Heat Exchanger HX-250 - Loose"]
["Heat Exchanger HX-350 - Loose"]